{"text_format":"1","workbook":"xlsx","n_sheets":9,"sheets":["Design worksheet","FET SOA CP","Sch & BOM","Startup nominal","Startup worstcase","Scratchpad","specs","Revision History","Variables"],"not_rendered":{"charts":6,"images":7,"macros":1,"external_links":2,"defined_names":50,"comments":0,"pivot_tables":0},"unopened":[],"bounds":{"document_bytes":16777216,"sheet_cells":100000,"rows_first":2000,"rows_last":500,"rows_between":2000,"halvings":0,"cell_chars":16384,"cell_head_chars":4096},"cells_cut":0,"cells_raw":0,"read":"whole","date_system":"1900"}

{"sheet":"Design worksheet","index":0,"n_rows":754,"n_cols":27,"rows_kept":754,"cut":false,"hidden":false,"merged":[[12,3,12,4],[17,3,18,9],[204,5,204,6],[187,5,187,6],[179,5,179,6],[13,3,13,4],[702,2,702,4],[232,4,232,5],[305,2,305,3],[555,2,555,3],[753,2,753,12],[750,2,750,3],[623,2,623,5],[366,2,366,5],[284,2,284,4],[555,4,555,5]]}
[null,null,null,null,null,null,null,"H","H",null,null,null,null,null,"H","H","H","H","H","H","H","H","H","H","H","H","H"]
[null,null,null,null,null,null,null,null,null,null,null,null,null,null,"x","x","x","x","x","x","x","x","x","x","x","x","x"]
[null,null,null,"ADM1281 Hot Swap Designer"]
[null,null,null,{"$f":"Variables!revtool","v":3}]
[]
[null,null,null,null,null,null,null,null,null,"Beta - Although the tool has been used and designs verified  many times it is not fully tested."]
[null,null,null,null,null,null,null,null,null,"Final design should be independently verified for absolute acuracy."]
[]
[null,null,"Please enter the data in the white cells:",null,null,null,null,"tolerance","RSS?"]
[]
[]
[]
[]
["x","Error combining options:",null,"Worst Case Stacked",null,null,null,null,null,null,null,null,null,null,0,"Full Datasheet specs"]
["x",null,"RSS",{"$f":"IF(D14=\"Root Sum Squares\",1,0)","v":0},null,{"$f":"IF(D13=P14,0,IF(D13=P15,1,IF(D13=P16,2,3)))","v":3},null,null,null,null,null,0,"Worst Case Stacked",null,1,"4 sigma 25->85C"]
["x",null,null,null,null,null,null,null,null,null,null,1,"Root Sum Squares",null,2,"6 sigma 25->85C"]
["x",null,null,null,null,null,null,null,null,null,null,null,null,null,3,"4 sigma -40->85C"]
[]
[]
[null,null,"ADM p/n","ADM1281"]
[null,null,null,null,null,null,null,null,null,null,null,null,"Warning: Selecting these options provides tolerance and specification data that is not guaranteed by ADI. Please choose the first options to comply with ADM1281 datasheet specifications. Other options should be used at your own risk!"]
[null,1,"System Specifications"]
[null,null,"Enter the system design specifications into this section."]
[]
[null,null,"Vmin",10.199999999999999,"V",null,null,null,null,"Minimum Supply voltage (lower tolerance). This is not UV spec!"]
[null,null,"Vmax",13.2,"V",null,null,null,null,"Maximum Supply voltage (higher tolerance). This is not OV spec!"]
[null,null,"Vnom",12,"V",null,null,null,null,"Nominal Supply Voltage"]
[null,null,"Imax",60,"A",null,null,null,null,"Maximum system load current"]
[null,null,"I_CB",70,"A",null,null,null,null,"Circuit breaker trip current. Usually some % higher than Imax."]
[null,null,"I powerup",0.05,"A",null,null,null,null,"DC Current demanded by load during cap charge (Excluding Inrush). E.g. Bias currents etc."]
{"$rows_left_out":725}
{"sheet":"FET SOA CP","index":1,"n_rows":37,"n_cols":5,"rows_kept":37,"cut":false,"hidden":false,"merged":[[36,0,36,5],[26,0,26,5],[20,0,20,4]]}
[]
[]
[]
[]
[]
["Section 8:"]
[1,"Paste a snapshot of the preferred MOSFET SOA diagram in white box. Right click image and send to back."]
[2,"Please ensure you are using the correct SOA diagram, this tool does not automatically present the correct SOA… you will need to copy and paste it in yourself."]
[3,"Using the red vertical line provided as an aid, determine the values for current on each intersection point of Voltage and time in the table below."]
[4,"Section 9 and 10 require SOA checks. As you get to each section in the design worksheet you will be redirected back to this page. Use the red and blue lines to determine intersect times."]
[5,"Complete this table first and then click link below…"]
[]
[null,"Time (µs)","Voltage","Current","Power"]
[null,100,{"$f":"'Design worksheet'!$D$26","v":13.2},230,{"$f":"D14*C14","v":3036}]
[null,300,{"$f":"'Design worksheet'!$D$26","v":13.2},130,{"$f":"D15*C15","v":1716}]
[null,400,{"$f":"'Design worksheet'!$D$26","v":13.2},105,1386]
[null,1000,{"$f":"'Design worksheet'!$D$26","v":13.2},60,792]
[null,100000,{"$f":"'Design worksheet'!$D$26","v":13.2},7,92.399999999999991]
[]
[]
["When table complete, click here to return to worksheet"]
[]
[]
[]
["Section 6:","Plot V and I:",{"$f":"'Design worksheet'!D26","v":13.2},{"$f":"'Design worksheet'!D368","v":30.477727145084227}]
[null,7000,"µs"]
["After time entered, click to return to worksheet. Check for Warnings!"]
[]
[]
["Section 12:","Plot Both points below and enter SOA time:"]
{"$rows_left_out":8}
{"sheet":"Sch & BOM","index":2,"n_rows":61,"n_cols":9,"rows_kept":61,"cut":false,"hidden":false,"merged":[[29,1,29,2],[57,1,57,2],[37,7,38,7],[51,1,51,2],[52,1,52,2],[53,1,53,2],[54,1,54,2],[55,1,55,2],[56,1,56,2],[46,1,46,2],[35,1,35,2],[36,1,36,2],[37,1,37,2],[38,1,38,2],[39,1,39,2],[49,1,49,2],[50,1,50,2],[41,1,41,2],[42,1,42,2],[43,1,43,2],[44,1,44,2],[45,1,45,2],[40,1,40,2],[30,1,30,2],[31,1,31,2],[32,1,32,2],[33,1,33,2],[34,1,34,2],[28,1,28,2],[7,1,7,11],[23,1,23,2],[24,1,24,2],[25,1,25,2],[26,1,26,2],[27,1,27,2],[21,1,21,2],[22,1,22,2]]}
[]
[]
[]
[]
[]
[]
[null,"DISCLAIMER:"]
[null,"This design tool is the property of Analog Devices.  It is a design aid for use with the ADM127x family of hotswap controllers.  It may not be copied, transferred, or used for other purposes without express written approval of Analog Devices Inc. Although ADI has made substantial effort to ensure this spreadsheet software provides accurate results, the complexity, estimates used, component tolerences, PCB thermal variances, and nonlinearities preclude absolute accuracy guarantees.  It is provided \"AS IS\" and all responsibility for the actual design performance and verification is born by the user. All designs should be verified independently and fully tested prior to manufacture. ADI disclaims any liability for damages of any kind resulting from the use of this spreadsheet software. "]
[]
[]
[null,"Specs:",null,"Vmin",{"$f":"'Design worksheet'!D25","v":10.199999999999999},"V"]
[null,null,null,"Vmax",{"$f":"'Design worksheet'!D26","v":13.2},"V"]
[null,null,null,"Vnom",{"$f":"'Design worksheet'!D27","v":12},"V"]
[null,null,null,"Circuit Breaker",{"$f":"'Design worksheet'!D224","v":69.528312375910005},"A"]
[null,null,null,"I powerup",{"$f":"'Design worksheet'!D30","v":0.05},"A"]
[null,null,null,"Rpowerup",{"$f":"'Design worksheet'!D31","v":10000},"Ohm"]
[null,null,null,"Ta Max",{"$f":"'Design worksheet'!D32","v":60},"C"]
[null,null,null,"Cload",{"$f":"'Design worksheet'!D33","v":3000},"uF"]
[]
[null,"Please ensure the design worksheet has been completed, without errors, before using the Bill of Materials listed below!"]
[null,"Schematic shown beside and below BOM for convenience"]
[null,"Ref Des",null,"Value*","Qty","Min. PD (mW)","Grade","Comments"]
[]
[null,"Ruvt",null,{"$f":"'Design worksheet'!D50/1000","v":51.1},{"$f":"IF(D24=\"DNP\",\"\",1)","v":1},{"$f":"25/D24","v":0.48923679060665359},{"$f":"'Design worksheet'!D48","v":"E96 (1%)"}]
[null,"Ruvb",null,{"$f":"'Design worksheet'!D52/1000","v":6.19},{"$f":"IF(D25=\"DNP\",\"\",1)","v":1},{"$f":"2/D25","v":0.32310177705977383},{"$f":"G24","v":"E96 (1%)"}]
[null,"Cuv",null,{"$f":"IF('Design worksheet'!D68 = 0,\"DNP\",'Design worksheet'!D68)","v":100},1,null,"Any","UV filtering capacitor. MLCC. User select, default 100nF. 25V+"]
[null,"Rovt",null,{"$f":"'Design worksheet'!D82/1000","v":51.1},1,{"$f":"25/D27","v":0.48923679060665359},{"$f":"'Design worksheet'!D80","v":"E96 (1%)"}]
[null,"Rovb",null,{"$f":"'Design worksheet'!D84/1000","v":3.32},1,{"$f":"2/D28","v":0.60240963855421692},{"$f":"G27","v":"E96 (1%)"}]
[null,"Cov",null,{"$f":"IF('Design worksheet'!D100 = 0,\"DNP\",'Design worksheet'!D100)","v":10},1,null,"Any","OV filtering capacitor. MLCC. User select, default 100nF.25V+"]
[null,"Cvcap",null,1,1,null,"Any","Datasheet specified"]
{"$rows_left_out":32}
{"sheet":"Startup nominal","index":3,"n_rows":115,"n_cols":15,"rows_kept":115,"cut":false,"hidden":true,"merged":[]}
[]
[]
[]
[]
[]
[]
[]
[null,"tstep",{"$f":"C10/(C9-1)","v":0.1199030303030303},"ms",null,"Pset",{"$f":"'Design worksheet'!D350","v":178.22421524663676},"W"]
[null,"#steps",100,null,null,"istart icb",{"$f":"'Design worksheet'!D613","v":7.9732777882976702},"A","ICBOS",{"$f":"(specs!D23/'Design worksheet'!D189)","v":3.52},"A"]
[null,"time",{"$f":"'Design worksheet'!D450","v":11.8704},"ms",null,"ICB clamp",{"$f":"'Design worksheet'!D470","v":8},"A"]
[null,"Vin",{"$f":"'Design worksheet'!D27","v":12},null,null,"ICB full",{"$f":"'Design worksheet'!D224","v":69.528312375910005},"A"]
[null,"vstep",{"$f":"C11/(C9-1)","v":0.12121212121212122},"V",null,"inrush",{"$f":"'Design worksheet'!D455","v":3.0840737403962799},"A"]
[]
[]
[null,"t","vout","PSET-I ideal","PSET ICB","ISTART ICB","inrush"]
[1,9.9999999999999995E-7,9.9999999999999995E-7,{"$f":"($G$8/($C$11-C16)) - $J$9","v":11.332019174887995},{"$f":"IF(D16>$G$10,IF(D16<$G$11,D16,$G$11),$G$10)","v":11.332019174887995},{"$f":"$G$9","v":7.9732777882976702},0]
[2,{"$f":"B16+$C$8","v":0.1199040303030303},{"$f":"C16+$C$12","v":0.12121312121212122},{"$f":"($G$8/($C$11-C17)) - $J$9","v":11.483570403716419},{"$f":"IF(D17>$G$10,IF(D17<$G$11,D17,$G$11),$G$10)","v":11.483570403716419},{"$f":"$G$9","v":7.9732777882976702},{"$f":"$G$12","v":3.0840737403962799}]
[3,{"$f":"B17+$C$8","v":0.23980706060606061},{"$f":"C17+$C$12","v":0.24242524242424243},11.638246400415321,11.638246400415321,7.9732777882976702,{"$f":"$G$12","v":3.0840737403962799}]
[4,{"$f":"B18+$C$8","v":0.3597100909090909},0.36363736363636368,11.796144813989043,11.796144813989043,7.9732777882976702,3.0840737403962799]
[5,0.47961312121212119,0.48484948484848489,11.95736740497931,11.95736740497931,7.9732777882976702,3.0840737403962799]
[6,0.59951615151515147,0.60606160606060611,12.122020264164048,12.122020264164048,7.9732777882976702,3.0840737403962799]
[7,0.71941918181818176,0.72727372727272732,12.290214045365799,12.290214045365799,7.9732777882976702,3.0840737403962799]
[8,0.83932221212121205,0.84848584848484854,12.462064213443295,12.462064213443295,7.9732777882976702,3.0840737403962799]
[9,0.95922524242424234,0.96969796969696975,12.637691308634139,12.637691308634139,7.9732777882976702,3.0840737403962799]
[10,1.0791282727272726,1.090910090909091,12.817221228520317,12.817221228520317,7.9732777882976702,3.0840737403962799]
[11,1.199031303030303,1.2121222121212121,13.000785529002627,13.000785529002627,7.9732777882976702,3.0840737403962799]
[12,1.3189343333333334,1.3333343333333332,13.188521745796109,13.188521745796109,7.9732777882976702,3.0840737403962799]
[13,1.4388373636363638,1.4545464545454543,13.380573738097546,13.380573738097546,7.9732777882976702,3.0840737403962799]
[14,1.5587403939393942,1.5757585757575754,13.577092056229798,13.577092056229798,7.9732777882976702,3.0840737403962799]
[15,1.6786434242424246,1.6969706969696965,13.778234335237489,13.778234335237489,7.9732777882976702,3.0840737403962799]
{"$rows_left_out":86}
{"sheet":"Startup worstcase","index":4,"n_rows":118,"n_cols":21,"rows_kept":118,"cut":false,"hidden":true,"merged":[]}
[]
[]
[]
[]
[]
[]
[]
[]
[]
[]
[null,"tstep",{"$f":"C13/(C12-1)","v":0.21133333333333335},"ms",null,"Pset",{"$f":"'Design worksheet'!D349","v":170.31802360450843},"W",null,null,null,"tstep",{"$f":"M13/(M12-1)","v":7.5212121212121216E-2},"ms",null,"Pset",{"$f":"'Design worksheet'!D351","v":186.38790113940124},"W"]
[null,"#steps",100,null,null,"istart icb",{"$f":"'Design worksheet'!D612","v":4.9899122146738879},"A","ICBwc",{"$f":"(specs!E23/'Design worksheet'!D202)","v":4.5529538502901277},"A","#steps",100,null,null,"istart icb",{"$f":"'Design worksheet'!D614","v":11.626844502288238},"A","ICBwc",{"$f":"(specs!C23/'Design worksheet'!D203)","v":1.9684585793698492},"A"]
[null,"time",{"$f":"'Design worksheet'!D451","v":20.922000000000001},"ms",null,"ICB clamp",{"$f":"'Design worksheet'!D469","v":6.2990674539835183},"A",null,null,null,"time",{"$f":"'Design worksheet'!D449","v":7.4459999999999997},"ms",null,"ICB clamp",{"$f":"'Design worksheet'!D471","v":9.7563296791931293},"A"]
[null,"Vin",{"$f":"'Design worksheet'!D26","v":13.2},null,null,"ICB full",{"$f":"'Design worksheet'!D207","v":64.750238761561803},"A",null,null,null,"Vin",{"$f":"'Design worksheet'!D25","v":10.199999999999999},null,null,"ICB full",{"$f":"'Design worksheet'!D208","v":75.031120787230336},"A"]
[null,"vstep",{"$f":"C14/(C12-1)","v":0.13333333333333333},"V",null,"inrush",{"$f":"'Design worksheet'!D454","v":1.7547900315457412},"A",null,null,null,"vstep",{"$f":"M14/(M12-1)","v":0.10303030303030303},"V",null,"inrush",{"$f":"'Design worksheet'!D456","v":4.5718679452054793},"A"]
[]
[null,"min",null,null,null,null,null,null,null,null,null,"max"]
[null,"t","vout","PSET-I ideal","PSET ICB","ISTART ICB","inrush",null,null,null,null,"t","vout","PSET-I ideal","PSET ICB","ISTART ICB","inrush"]
[1,9.9999999999999995E-7,9.9999999999999995E-7,{"$f":"($G$11/($C$14-C19)) - $J$12","v":8.3499277033000219},{"$f":"IF(D19>$G$13,IF(D19<$G$14,D19,$G$14),$G$13)","v":8.3499277033000219},{"$f":"$G$12","v":4.9899122146738879},0,null,null,null,null,9.9999999999999995E-7,9.9999999999999995E-7,{"$f":"($Q$11/($M$14-M19)) - $T$12","v":16.304866853250413},{"$f":"IF(N19>$Q$13,IF(N19<$Q$14,N19,$Q$14),$Q$13)","v":16.304866853250413},{"$f":"$Q$12","v":11.626844502288238},0]
[2,{"$f":"B19+$C$11","v":0.21133433333333335},{"$f":"C19+$C$15","v":0.13333433333333333},{"$f":"($G$11/($C$14-C20)) - $J$12","v":8.4815897700454883},8.4815897700454883,{"$f":"$G$12","v":4.9899122146738879},{"$f":"$G$15","v":1.7547900315457412},null,null,null,null,{"$f":"L19+$M$11","v":7.5213121212121217E-2},{"$f":"M19+$M$15","v":0.10303130303030303},{"$f":"($Q$11/($M$14-M20)) - $T$12","v":16.491329376132082},{"$f":"IF(N20>$Q$13,IF(N20<$Q$14,N20,$Q$14),$Q$13)","v":16.491329376132082},{"$f":"$Q$12","v":11.626844502288238},{"$f":"$Q$15","v":4.5718679452054793}]
[3,{"$f":"B20+$C$11","v":0.42266766666666666},{"$f":"C20+$C$15","v":0.26666766666666664},8.6159665187894205,8.6159665187894205,4.9899122146738879,{"$f":"$G$15","v":1.7547900315457412},null,null,null,null,{"$f":"L20+$M$11","v":0.15042524242424243},{"$f":"M20+$M$15","v":0.20606160606060606},16.681636487499098,16.681636487499098,11.626844502288238,{"$f":"$Q$15","v":4.5718679452054793}]
[4,{"$f":"B21+$C$11","v":0.63400100000000004},0.40000099999999994,8.7531427833508921,8.7531427833508921,4.9899122146738879,1.7547900315457412,null,null,null,null,0.22563736363636366,0.30909190909090911,16.875908330753774,16.875908330753774,11.626844502288238,4.5718679452054793]
[5,0.84533433333333341,0.53333433333333324,8.8932069694995484,8.8932069694995484,4.9899122146738879,1.7547900315457412,null,null,null,null,0.30084948484848489,0.41212221212121214,17.074270107968502,17.074270107968502,11.626844502288238,4.5718679452054793]
[6,1.0566676666666668,0.66666766666666655,9.0362512449529753,9.0362512449529753,4.9899122146738879,1.7547900315457412,null,null,null,null,0.37606160606060612,0.51515251515151517,17.276852348964013,17.276852348964013,11.626844502288238,4.5718679452054793]
[7,1.2680010000000002,0.80000099999999985,9.1823717416319717,9.1823717416319717,4.9899122146738879,1.7547900315457412,null,null,null,null,0.45127372727272735,0.61818281818181819,17.483791197747433,17.483791197747433,11.626844502288238,4.5718679452054793]
[8,1.4793343333333335,0.93333433333333315,9.3316687711064255,9.3316687711064255,4.9899122146738879,1.7547900315457412,null,null,null,null,0.52648584848484858,0.72121312121212122,17.695228717631181,17.695228717631181,11.626844502288238,4.5718679452054793]
[9,1.6906676666666669,1.0666676666666666,9.4842470542463566,9.4842470542463566,4.9899122146738879,1.7547900315457412,null,null,null,null,0.60169796969696976,0.82424342424242425,17.911313216469551,17.911313216469551,11.626844502288238,4.5718679452054793]
[10,1.9020010000000003,1.2000009999999999,9.6402159661830602,9.6402159661830602,4.9899122146738879,1.7547900315457412,null,null,null,null,0.67691009090909093,0.92727372727272728,18.132199593577734,18.132199593577734,11.626844502288238,4.5718679452054793]
[11,2.1133343333333334,1.3333343333333332,9.7996897977844846,9.7996897977844846,4.9899122146738879,1.7547900315457412,null,null,null,null,0.75212221212121211,1.0303040303030304,18.35804971003866,18.35804971003866,11.626844502288238,4.5718679452054793]
[12,2.3246676666666666,1.4666676666666665,9.9627880349584785,9.9627880349584785,4.9899122146738879,1.7547900315457412,null,null,null,null,0.82733433333333328,1.1333343333333334,18.589032784258016,18.589032784258016,11.626844502288238,4.5718679452054793]
{"$rows_left_out":89}
{"sheet":"Scratchpad","index":5,"n_rows":0,"n_cols":0,"rows_kept":0,"cut":false,"hidden":false,"merged":[]}

{"sheet":"specs","index":6,"n_rows":38,"n_cols":9,"rows_kept":38,"cut":false,"hidden":true,"merged":[[2,12,2,13],[3,12,3,13],[4,12,4,13],[2,8,2,9],[3,8,3,9],[4,8,4,9],[2,10,2,11],[3,10,3,11],[4,10,4,11],[2,2,2,4],[3,2,3,4],[4,2,4,4],[2,5,2,7],[3,5,3,7],[4,5,4,7]]}
["KEY",0]
[]
[null,"V","CURRENT",null,null,"FULL DS"]
[null,"T","CURRENT",null,null,"FULL DS"]
[null,"SD","CURRENT",null,null,"FULL DS"]
[]
[null,"Spec","Min","Typ","Max","Min","Typ","Max"]
[]
[]
[null,"UV threshold",{"$f":"IF($B$1=$R$6,F10,IF($B$1=$R$7,I10,IF($B$1=$R$8,K10,IF($B$1=$R$9,M10,Q10))))","v":0.99},{"$f":"IF(G10=\"\",\"\",G10)","v":1},{"$f":"IF($B$1=$R$6,H10,IF($B$1=$R$7,J10,IF($B$1=$R$8,L10,IF($B$1=$R$9,N10,Q10))))","v":1.01},0.99,1,1.01,"V"]
[null,"UV lkg",null,{"$f":"IF(G11=\"\",\"\",G11)","v":""},{"$f":"H11","v":50},null,null,50,"nA"]
[null,"UV hyst",{"$f":"IF($B$1=$R$6,F12,IF($B$1=$R$7,I12,IF($B$1=$R$8,K12,IF($B$1=$R$9,M12,Q12))))","v":40},60,{"$f":"IF($B$1=$R$6,H12,IF($B$1=$R$7,J12,IF($B$1=$R$8,L12,IF($B$1=$R$9,N12,Q12))))","v":75},40,60,75,"mV"]
[null,"OV threshold",0.99,1,1.01,0.99,1,1.01,"V"]
[null,"OV lkg",null,"",{"$f":"H14","v":50},null,null,50,"nA"]
[null,"OV hyst",40,60,75,40,60,75,"mV"]
[null,"Sense I",null,"",{"$f":"H16","v":150},null,null,150,"uA"]
[null,"Sense imbalance",null,"",{"$f":"H17","v":8},null,null,8,"uA"]
[null,"VCAP",2.68,2.7,2.72,2.68,2.7,2.72,"V"]
[null,"Iset Lkg",null,"",{"$f":"H19","v":100},null,null,100,"nA"]
[null,"Gate current",20,25,30,20,25,30,"uA"]
[null,"Vsense tolerance",null,"",0.25,null,null,0.25,"mV"]
[null,"Vsesne tol foldback",null,"",0.4,null,null,0.4,"mV"]
[null,"Vcbos",0.5,0.88,1.1200000000000001,0.5,0.88,1.1200000000000001,"mV"]
[null,"Vsoc @ 5mV",9.5,11.25,13,9.5,11.25,13,"mV"]
[null,"SS current",{"$f":"F25","v":8},{"$f":"G25","v":10},12,8,10,12,"uA"]
[null,"SS start level",{"$f":"F26","v":0.5},1.25,1.8,0.5,1.25,1.8,"mV"]
[null,"Timer current up",57,60,63,57,60,63,"uA"]
[null,"Timer V",0.98,1,1.02,0.98,1,1.02,"V"]
[null,"Timer down",1.7,2,2.2999999999999998,1.7,2,2.2999999999999998,"uA"]
[null,"Timer V low",0.18,0.2,0.22,0.18,0.2,0.22,"V"]
{"$rows_left_out":9}
{"sheet":"Revision History","index":7,"n_rows":23,"n_cols":5,"rows_kept":23,"cut":false,"hidden":true,"merged":[]}
[]
[]
[]
[]
[]
[null,null,"Rev","Comments","Date"]
[]
[null,null,1,"Initial beta tool - convert from ADM1275/6","2013-09-30"]
[null,null,1.1000000000000001,"blank 20mV iset and add tolerance to istart. Add warning to clamp ISTART","2014-04-30"]
[null,null,2,"Web release. Reconfigured all resistor calculation to auto populate. Tool tidy up. Add comments. Add error flags. Optimized for dvdt only. Add BOM and Sch. Add PLIM tol,","2014-08-29"]
[null,null,2.1,"gcm: added macros, toolOpen, toolClose, standard locking, row show/hide, etc."]
[null,null,2.2000000000000002,"cell D312 error. 18 to be D25. Also add overide for R2 on strings for checking existing designs. Corrrected istart clamp tolerance issue and roverride","2014-01-22"]
[null,null,2.5,"Corrrected istart clamp tolerance issue and roverride. Fixed bugs on timer / SOA when PLIM limits reached. Added VCAP current strings","2015-01-27"]
[null,null,2.6,"add show hide macro","2015-02-16"]
[null,null,2.7,"improved wanrings and error handling for PLIM and ISTART","2015-02-19"]
[null,null,2.8,"minor tweaks to istart/pset. Include startup diagrams","2015-02-20"]
[null,null,2.9,"Clean out all FC macros etc.Create hide/show RC macros","2015-02-24"]
[null,null,2.95,"add tolerance to plots","2015-02-25"]
[null,null,2.96,"clean up istart and add offsets. Clean up inrush calc and remove sim data. Add tolerancing options from 4sig and reduced temp","2015-03-11"]
[null,null,2.97,"improve startup SOA to reflect more accurate profiles (currents not energy). Add Roverride warnings. Correct startup plot x axis timebase. ","2015-04-27"]
[null,null,2.98,"powerup soa… add % Vds input.","2015-05-05"]
[null,null,2.99,"editable SOA times","2015-11-10"]
[null,null,3,"add more details around FET transconductance and starup in to short SOA","2019-11-04"]

{"sheet":"Variables","index":8,"n_rows":6,"n_cols":2,"rows_kept":6,"cut":false,"hidden":true,"merged":[]}
[]
["revtool",{"$f":"MAX('Revision History'!C8:C54)","v":3}]
["revname","ADM1281 Hot Swap Designer"]
["revlink",0]
["revtext","ADM1281"]
["revDB",0]